BDBM90894 2-chloranyl-N-[[(3-nitrophenyl)carbonylamino]carbamothioyl]benzamide::2-chloro-N-[[(3-nitrobenzoyl)amino]carbamothioyl]benzamide::2-chloro-N-[[(3-nitrobenzoyl)amino]thiocarbamoyl]benzamide::2-chloro-N-[[[(3-nitrophenyl)-oxomethyl]hydrazo]-sulfanylidenemethyl]benzamide::MLS001181587::SMR000567361::cid_3806162
SMILES [O-][N+](=O)c1cccc(c1)C(=O)NNC(=S)NC(=O)c1ccccc1Cl
InChI Key InChIKey=JMDLZLSJUDTNQU-UHFFFAOYSA-N
Data  1 IC50  1 EC50
  Tab Delimited (TSV)   2D SDfile   Computed 3D by Vconf -m prep SDfile
Find this compound or compounds like it in BindingDB:
Activity Spreadsheet -- Enzyme Inhibition Constant Data from BindingDB
Found 2 hits for monomerid = 90894
TargetGroup 3 secretory phospholipase A2(Homo sapiens)
The Scripps Research Institute Molecular Screening Center
Curated by PubChem BioAssay
LigandPNGBDBM90894(2-chloranyl-N-[[(3-nitrophenyl)carbonylamino]carba...)
Affinity DataIC50:  2.23E+4nM. Assay description: Source (MLPCN Center Name): The Scripps Research Institute Molecular Screening Center Affiliation: The Scripps Research Institute, TSRI Assay Provide...
In DepthDetails PCBioAssay
TargetCorticotropin-releasing factor-binding protein(Homo sapiens (Human))
Burnham Center For Chemical Genomics
Curated by PubChem BioAssay
LigandPNGBDBM90894(2-chloranyl-N-[[(3-nitrophenyl)carbonylamino]carba...)
Affinity DataEC50:  1.12E+4nM. Assay description: Data Source: Sanford-Burnham Center for Chemical Genomics (SBCCG) Source Affiliation: Sanford-Burnham Medical Research Institute (SBMRI, San Diego, C...
In DepthDetails PCBioAssay