BDBM91492 2-[(4-chlorophenyl)sulfonyl-methyl-amino]-N-(2-morpholin-4-ylphenyl)ethanamide::2-[(4-chlorophenyl)sulfonyl-methyl-amino]-N-(2-morpholinophenyl)acetamide::2-[(4-chlorophenyl)sulfonyl-methylamino]-N-(2-morpholin-4-ylphenyl)acetamide::2-[(4-chlorophenyl)sulfonyl-methylamino]-N-[2-(4-morpholinyl)phenyl]acetamide::MLS000570289::SMR000150317::cid_2413278
SMILES CN(CC(=O)Nc1ccccc1N1CCOCC1)S(=O)(=O)c1ccc(Cl)cc1
InChI Key InChIKey=RYYWHLPZSHDIJC-UHFFFAOYSA-N
Data  1 EC50
  Tab Delimited (TSV)   2D SDfile   Computed 3D by Vconf -m prep SDfile
Find this compound or compounds like it in BindingDB:
Activity Spreadsheet -- Enzyme Inhibition Constant Data from BindingDB
Found 1 hit for monomerid = 91492
TargetMitochondrial peptide methionine sulfoxide reductase(Bos taurus)
The Scripps Research Institute Molecular Screening Center
Curated by PubChem BioAssay
LigandPNGBDBM91492(2-[(4-chlorophenyl)sulfonyl-methyl-amino]-N-(2-mor...)
Affinity DataEC50: >1.04E+5nM. Assay description: Source (MLPCN Center Name): The Scripps Research Institute Molecular Screening Center (SRIMSC) Affiliation: The Scripps Research Institute, TSRI Assa...
In DepthDetails PCBioAssay