BDBM91496 MLS000335811::N-(3-acetylphenyl)-2-(4-ethoxyanilino)-2-phenylacetamide::N-(3-acetylphenyl)-2-phenyl-2-(p-phenetidino)acetamide::N-(3-ethanoylphenyl)-2-[(4-ethoxyphenyl)amino]-2-phenyl-ethanamide::SMR000253565::cid_4881004
SMILES CCOc1ccc(NC(C(=O)Nc2cccc(c2)C(C)=O)c2ccccc2)cc1
InChI Key InChIKey=DAOJZHNNAVZHBT-UHFFFAOYSA-N
Data  1 EC50
  Tab Delimited (TSV)   2D SDfile   Computed 3D by Vconf -m prep SDfile
Find this compound or compounds like it in BindingDB:
Activity Spreadsheet -- Enzyme Inhibition Constant Data from BindingDB
Found 1 hit for monomerid = 91496
TargetMitochondrial peptide methionine sulfoxide reductase(Bos taurus)
The Scripps Research Institute Molecular Screening Center
Curated by PubChem BioAssay
LigandPNGBDBM91496(MLS000335811 | N-(3-acetylphenyl)-2-(4-ethoxyanili...)
Affinity DataEC50: >1.04E+5nM. Assay description: Source (MLPCN Center Name): The Scripps Research Institute Molecular Screening Center (SRIMSC) Affiliation: The Scripps Research Institute, TSRI Assa...
In DepthDetails PCBioAssay