BDBM91501 2,2-dimethyl-N-(2,2,2-trichloro-1-pyrimidin-4-ylsulfanylethyl)propanamide::2,2-dimethyl-N-[2,2,2-trichloro-1-(4-pyrimidinylthio)ethyl]propanamide::2,2-dimethyl-N-[2,2,2-trichloro-1-(4-pyrimidylthio)ethyl]propionamide::2,2-dimethyl-N-[2,2,2-tris(chloranyl)-1-pyrimidin-4-ylsulfanyl-ethyl]propanamide::MLS000717048::SMR000280015::cid_3090179
SMILES CC(C)(C)C(=O)NC(Sc1ccncn1)C(Cl)(Cl)Cl
InChI Key InChIKey=XUDXPPUNNVWLHL-UHFFFAOYSA-N
Data  1 EC50
  Tab Delimited (TSV)   2D SDfile   Computed 3D by Vconf -m prep SDfile
Find this compound or compounds like it in BindingDB:
Activity Spreadsheet -- Enzyme Inhibition Constant Data from BindingDB
Found 1 hit for monomerid = 91501
TargetMitochondrial peptide methionine sulfoxide reductase(Bos taurus)
The Scripps Research Institute Molecular Screening Center
Curated by PubChem BioAssay
LigandPNGBDBM91501(2,2-dimethyl-N-(2,2,2-trichloro-1-pyrimidin-4-ylsu...)
Affinity DataEC50: >1.04E+5nM. Assay description: Source (MLPCN Center Name): The Scripps Research Institute Molecular Screening Center (SRIMSC) Affiliation: The Scripps Research Institute, TSRI Assa...
In DepthDetails PCBioAssay