BDBM91509 7-chloranyl-10-[5-(diethylamino)pentan-2-yl]benzo[g]pteridine-2,4-dione;sulfuric acid::7-chloro-10-[4-(diethylamino)-1-methyl-butyl]benzo[g]pteridine-2,4-quinone;sulfuric acid::7-chloro-10-[5-(diethylamino)pentan-2-yl]benzo[g]pteridine-2,4-dione;sulfuric acid::MLS002608125::SMR001526876::cid_44602155
SMILES CCN(CC)CCCC(C)n1c2ccc(Cl)cc2nc2c1nc(=O)[nH]c2=O
InChI Key InChIKey=XTRPGNLBZMRDGL-UHFFFAOYSA-N
Data  2 IC50  1 EC50
  Tab Delimited (TSV)   2D SDfile   Computed 3D by Vconf -m prep SDfile
Find this compound or compounds like it in BindingDB:
Activity Spreadsheet -- Enzyme Inhibition Constant Data from BindingDB
Found 3 hits for monomerid = 91509
TargetMitochondrial peptide methionine sulfoxide reductase(Bos taurus)
The Scripps Research Institute Molecular Screening Center
Curated by PubChem BioAssay
LigandPNGBDBM91509(7-chloranyl-10-[5-(diethylamino)pentan-2-yl]benzo[...)
Affinity DataEC50:  3.29E+4nM. Assay description: Source (MLPCN Center Name): The Scripps Research Institute Molecular Screening Center (SRIMSC) Affiliation: The Scripps Research Institute, TSRI Assa...
Ligand InfoPC cidPC sid
In DepthDetails PCBioAssay
TargetTyrosyl-DNA phosphodiesterase 2(Homo sapiens (Human))
The Scripps Research Institute Molecular Screening Center
Curated by PubChem BioAssay
LigandPNGBDBM91509(7-chloranyl-10-[5-(diethylamino)pentan-2-yl]benzo[...)
Affinity DataIC50:  1.05E+4nM. Assay description: Source (MLPCN Center Name): The Scripps Research Institute Molecular Screening Center (SRIMSC) Center Affiliation: The Scripps Research Institute (TS...
Ligand InfoPC cidPC sid
In DepthDetails PCBioAssay
TargetEndothelial PAS domain-containing protein 1(Homo sapiens (Human))
Burnham Center For Chemical Genomics
Curated by PubChem BioAssay
LigandPNGBDBM91509(7-chloranyl-10-[5-(diethylamino)pentan-2-yl]benzo[...)
Affinity DataIC50:  9.02E+3nM
Ligand InfoPC cidPC sid
In DepthDetails PCBioAssay