BDBM9176 (3R,3aS,6aR)-hexahydrofuro[2,3-b]furan-3-yl N-[(2S,3R)-4-[(cyclopentyloxy)(2,3-dihydro-1,4-benzodioxine-6-)sulfonamido]-3-hydroxy-1-phenylbutan-2-yl]carbamate::N-alkoxysulfonamide analog 17::N-alkoxysulfonamide analog entry p
SMILES [H][C@@]12CCO[C@]1([H])OC[C@@H]2OC(=O)N[C@@H](Cc1ccccc1)[C@H](O)CN(OC1CCCC1)S(=O)(=O)c1ccc2OCCOc2c1
InChI Key InChIKey=JUQPIABICJKAQY-KTJDEMTHSA-N
Data  1 KI  1 IC50
  Tab Delimited (TSV)   2D SDfile   Computed 3D by Vconf -m prep SDfile
Find this compound or compounds like it in BindingDB:
Activity Spreadsheet -- Enzyme Inhibition Constant Data from BindingDB
Found 1 hit for monomerid = 9176
TargetDimer of Gag-Pol polyprotein [501-599,Q508K,L534I,L564I,C568A,C596A](Human immunodeficiency virus type 1)
Glaxosmithkline
LigandPNGBDBM9176((3R,3aS,6aR)-hexahydrofuro[2,3-b]furan-3-yl N-[(2S...)
Affinity DataKi: <0.00500nM IC50:  7nM. Assay description: The Ki values were determined using fluorogenic substrate, 2-(aminobenzoyl)-Thr-Ile-Nle-Phe(p-NO2)-Gln-ArgNH2. A standard curve relating changes in f...
In DepthDetails ArticlePubMed