BDBM93017 Indole-4-carboxylate
SMILES COC(=O)c1cccc2[nH]ccc12
InChI Key InChIKey=WEAXQUBYRSEBJD-UHFFFAOYSA-N
Data  4 KI
PDB links: 2 PDB IDs match this monomer.
  Tab Delimited (TSV)   2D SDfile   Computed 3D by Vconf -m prep SDfile
Find this compound or compounds like it in BindingDB:
Activity Spreadsheet -- Enzyme Inhibition Constant Data from BindingDB
Found 4 hits for monomerid = 93017
TargetChymotrypsinogen A(Bos taurus (bovine))
California Institute Of Technology
LigandPNGBDBM93017(Indole-4-carboxylate)
Affinity DataKi:  1.02E+7nM. Assay description: Kinetic assay using chymotrypsin.
In DepthDetails ArticlePubMed
TargetChymotrypsinogen A(Bos taurus (bovine))
California Institute Of Technology
LigandPNGBDBM93017(Indole-4-carboxylate)
Affinity DataKi:  1.10E+7nM. Assay description: Kinetic assay using chymotrypsin.
In DepthDetails ArticlePubMed
TargetChymotrypsinogen A(Bos taurus (bovine))
California Institute Of Technology
LigandPNGBDBM93017(Indole-4-carboxylate)
Affinity DataKi:  1.14E+7nM. Assay description: Kinetic assay using chymotrypsin.
In DepthDetails ArticlePubMed
TargetCoagulation factor VII/Tissue factor(Homo sapiens (Human))
Bristol-Myers Squibb
Curated by ChEMBL
LigandPNGBDBM93017(Indole-4-carboxylate)
Affinity DataKi:  1.30E+7nM. Assay description: Inhibition of human soluble tissue factor/factor VIIa expressed in Origami B (DE3) using D-Ile-Pro-Arg-pNA as substrate after 30 mins by spectrophoto...
In DepthDetails ArticlePubMed