BDBM93019 Indole-5-carboxylate
SMILES COC(=O)c1ccc2[nH]ccc2c1
InChI Key InChIKey=DRYBMFJLYYEOBZ-UHFFFAOYSA-N
Data  3 KI
  Tab Delimited (TSV)   2D SDfile   Computed 3D by Vconf -m prep SDfile
Find this compound or compounds like it in BindingDB:
Activity Spreadsheet -- Enzyme Inhibition Constant Data from BindingDB
Found 3 hits for monomerid = 93019
TargetChymotrypsinogen A(Bos taurus (bovine))
California Institute Of Technology
LigandPNGBDBM93019(Indole-5-carboxylate)
Affinity DataKi:  2.60E+6nM. Assay description: Kinetic assay using chymotrypsin.
In DepthDetails ArticlePubMed
TargetChymotrypsinogen A(Bos taurus (bovine))
California Institute Of Technology
LigandPNGBDBM93019(Indole-5-carboxylate)
Affinity DataKi:  2.80E+6nM. Assay description: Kinetic assay using chymotrypsin.
In DepthDetails ArticlePubMed
TargetChymotrypsinogen A(Bos taurus (bovine))
California Institute Of Technology
LigandPNGBDBM93019(Indole-5-carboxylate)
Affinity DataKi:  3.00E+6nM. Assay description: Kinetic assay using chymotrypsin.
In DepthDetails ArticlePubMed