BDBM93630 2-(1'-keto-5'-methyl-spiro[1-pyrazoline-3,2'-indane]-4-yl)-4-methyl-benzoic acid methyl ester::4-methyl-2-(6-methyl-3-oxo-4'-spiro[1H-indene-2,5'-3,4-dihydropyrazole]yl)benzoic acid methyl ester::Benzoic acid, 2-[1,3,4',5'-tetrahydro-1-oxospiro[2H-inden- 2,3'-[3H]pyrazol]-4'-yl]-4-methyl-, methyl ester::MLS002702538::SMR001566148::cid_385674::methyl 4-methyl-2-(6-methyl-3-oxidanylidene-spiro[1H-indene-2,5'-3,4-dihydropyrazole]-4'-yl)benzoate::methyl 4-methyl-2-(6-methyl-3-oxospiro[1H-indene-2,5'-3,4-dihydropyrazole]-4'-yl)benzoate
SMILES COC(=O)c1ccc(C)cc1C1CN=NC11Cc2cc(C)ccc2C1=O
InChI Key InChIKey=NKARWVSZUPOVCS-UHFFFAOYSA-N
Data  3 IC50
  Tab Delimited (TSV)   2D SDfile   Computed 3D by Vconf -m prep SDfile
Find this compound or compounds like it in BindingDB:
Activity Spreadsheet -- Enzyme Inhibition Constant Data from BindingDB
Found 3 hits for monomerid = 93630
TargetSentrin-specific protease 8(Homo sapiens (Human))
Burnham Center For Chemical Genomics
Curated by PubChem BioAssay
LigandPNGBDBM93630(2-(1'-keto-5'-methyl-spiro[1-pyrazoline-3,2'-indan...)
Affinity DataIC50:  1.39E+4nM
Ligand InfoPC cidPC sid
In DepthDetails PCBioAssay
TargetSentrin-specific protease 8(Homo sapiens (Human))
Burnham Center For Chemical Genomics
Curated by PubChem BioAssay
LigandPNGBDBM93630(2-(1'-keto-5'-methyl-spiro[1-pyrazoline-3,2'-indan...)
Affinity DataIC50:  1.39E+4nM
Ligand InfoPC cidPC sid
In DepthDetails PCBioAssay
TargetCaspase-3(Homo sapiens (Human))
Burnham Center For Chemical Genomics
Curated by PubChem BioAssay
LigandPNGBDBM93630(2-(1'-keto-5'-methyl-spiro[1-pyrazoline-3,2'-indan...)
Affinity DataIC50: >1.00E+5nM
Ligand InfoPC cidPC sid
In DepthDetails PCBioAssay