BDBM93652 2-[3-isopropyl-7-[(3-methylbenzyl)amino]benzimidazol-5-yl]oxybutan-1-ol::2-[7-[(3-methylphenyl)methylamino]-3-propan-2-yl-benzimidazol-5-yl]oxybutan-1-ol::2-[7-[(3-methylphenyl)methylamino]-3-propan-2-ylbenzimidazol-5-yl]oxybutan-1-ol::2-[[7-[(3-methylphenyl)methylamino]-3-propan-2-yl-5-benzimidazolyl]oxy]-1-butanol::MLS002471433::SMR001395099::cid_44143077
SMILES CCC(CO)Oc1cc(NCc2cccc(C)c2)c2ncn(C(C)C)c2c1
InChI Key InChIKey=FOVHWQHAZMIYGZ-UHFFFAOYSA-N
Data  3 IC50
  Tab Delimited (TSV)   2D SDfile   Computed 3D by Vconf -m prep SDfile
Find this compound or compounds like it in BindingDB:
Activity Spreadsheet -- Enzyme Inhibition Constant Data from BindingDB
Found 3 hits for monomerid = 93652
TargetSentrin-specific protease 8(Homo sapiens (Human))
Burnham Center For Chemical Genomics
Curated by PubChem BioAssay
LigandPNGBDBM93652(2-[3-isopropyl-7-[(3-methylbenzyl)amino]benzimidaz...)
Affinity DataIC50:  1.26E+4nM
In DepthDetails PCBioAssay
TargetSentrin-specific protease 8(Homo sapiens (Human))
Burnham Center For Chemical Genomics
Curated by PubChem BioAssay
LigandPNGBDBM93652(2-[3-isopropyl-7-[(3-methylbenzyl)amino]benzimidaz...)
Affinity DataIC50:  1.26E+4nM
In DepthDetails PCBioAssay
TargetCaspase-3(Homo sapiens (Human))
Burnham Center For Chemical Genomics
Curated by PubChem BioAssay
LigandPNGBDBM93652(2-[3-isopropyl-7-[(3-methylbenzyl)amino]benzimidaz...)
Affinity DataIC50:  4.66E+4nM
In DepthDetails PCBioAssay