BDBM93745 2-(4-Chloro-benzyl)-5-phenyl-2H-tetrazole::2-(4-chlorobenzyl)-5-phenyl-tetrazole::2-[(4-chlorophenyl)methyl]-5-phenyl-1,2,3,4-tetrazole::2-[(4-chlorophenyl)methyl]-5-phenyltetrazole::MLS000121251::SMR000118619::cid_763900
SMILES Clc1ccc(Cn2nnc(n2)-c2ccccc2)cc1
InChI Key InChIKey=BSUKFGAPVWFTEP-UHFFFAOYSA-N
Data  2 IC50
  Tab Delimited (TSV)   2D SDfile   Computed 3D by Vconf -m prep SDfile
Find this compound or compounds like it in BindingDB:
Activity Spreadsheet -- Enzyme Inhibition Constant Data from BindingDB
Found 2 hits for monomerid = 93745
TargetHeat shock protein hsp-16.2(Caenorhabditis elegans)
Burnham Center For Chemical Genomics
Curated by PubChem BioAssay
LigandPNGBDBM93745(2-(4-Chloro-benzyl)-5-phenyl-2H-tetrazole | 2-(4-c...)
Affinity DataIC50: >6.40E+4nM
In DepthDetails PCBioAssay
TargetProtein skinhead-1(Caenorhabditis elegans)
Burnham Center For Chemical Genomics
Curated by PubChem BioAssay
LigandPNGBDBM93745(2-(4-Chloro-benzyl)-5-phenyl-2H-tetrazole | 2-(4-c...)
Affinity DataIC50:  2.09E+4nM
In DepthDetails PCBioAssay