BDBM93782 (4-nitrophenyl)-phenyl-amine::4-nitro-N-phenyl-aniline::4-nitro-N-phenylaniline::MLS000584664::N-(4-nitrophenyl)-N-phenylamine::SMR000203627::cid_13271
SMILES [O-][N+](=O)c1ccc(Nc2ccccc2)cc1
InChI Key InChIKey=XXYMSQQCBUKFHE-UHFFFAOYSA-N
Data  2 IC50
  Tab Delimited (TSV)   2D SDfile   Computed 3D by Vconf -m prep SDfile
Find this compound or compounds like it in BindingDB:
Activity Spreadsheet -- Enzyme Inhibition Constant Data from BindingDB
Found 2 hits for monomerid = 93782
TargetHeat shock protein hsp-16.2(Caenorhabditis elegans)
Burnham Center For Chemical Genomics
Curated by PubChem BioAssay
LigandPNGBDBM93782((4-nitrophenyl)-phenyl-amine | 4-nitro-N-phenyl-an...)
Affinity DataIC50:  4.65E+4nM
In DepthDetails PCBioAssay
TargetProtein skinhead-1(Caenorhabditis elegans)
Burnham Center For Chemical Genomics
Curated by PubChem BioAssay
LigandPNGBDBM93782((4-nitrophenyl)-phenyl-amine | 4-nitro-N-phenyl-an...)
Affinity DataIC50:  1.22E+4nM
In DepthDetails PCBioAssay