BDBM93958 1-[3-(5,7-dimethyl-2-phenyl-6-pyrazolo[1,5-a]pyrimidinyl)-1-oxopropyl]-4-piperidinecarboxylic acid ethyl ester::1-[3-(5,7-dimethyl-2-phenyl-pyrazolo[1,5-a]pyrimidin-6-yl)propanoyl]isonipecotic acid ethyl ester::MLS000522522::SMR000127789::cid_9550751::ethyl 1-[3-(5,7-dimethyl-2-phenyl-pyrazolo[1,5-a]pyrimidin-6-yl)propanoyl]piperidine-4-carboxylate::ethyl 1-[3-(5,7-dimethyl-2-phenylpyrazolo[1,5-a]pyrimidin-6-yl)propanoyl]piperidine-4-carboxylate
SMILES CCOC(=O)C1CCN(CC1)C(=O)CCc1c(C)nc2cc(nn2c1C)-c1ccccc1
InChI Key InChIKey=ZWHUBLQKIGLEBR-UHFFFAOYSA-N
Data  1 IC50
  Tab Delimited (TSV)   2D SDfile   Computed 3D by Vconf -m prep SDfile
Find this compound or compounds like it in BindingDB:
Activity Spreadsheet -- Enzyme Inhibition Constant Data from BindingDB
Found 1 hit for monomerid = 93958
TargetEndothelial PAS domain-containing protein 1(Homo sapiens (Human))
Burnham Center For Chemical Genomics
Curated by PubChem BioAssay
LigandPNGBDBM93958(1-[3-(5,7-dimethyl-2-phenyl-6-pyrazolo[1,5-a]pyrim...)
Affinity DataIC50:  1.39E+3nM
In DepthDetails PCBioAssay