BDBM93990 3-[2-(4-chlorophenyl)-5,7-dimethyl-6-pyrazolo[1,5-a]pyrimidinyl]-N-(4-methyl-2-thiazolyl)propanamide::3-[2-(4-chlorophenyl)-5,7-dimethyl-pyrazolo[1,5-a]pyrimidin-6-yl]-N-(4-methyl-1,3-thiazol-2-yl)propanamide::3-[2-(4-chlorophenyl)-5,7-dimethyl-pyrazolo[1,5-a]pyrimidin-6-yl]-N-(4-methylthiazol-2-yl)propionamide::3-[2-(4-chlorophenyl)-5,7-dimethylpyrazolo[1,5-a]pyrimidin-6-yl]-N-(4-methyl-1,3-thiazol-2-yl)propanamide::MLS000586822::SMR000208752::cid_15945494
SMILES Cc1csc(NC(=O)CCc2c(C)nc3cc(nn3c2C)-c2ccc(Cl)cc2)n1
InChI Key InChIKey=WLUOLHQWUASRRZ-UHFFFAOYSA-N
Data  1 IC50
  Tab Delimited (TSV)   2D SDfile   Computed 3D by Vconf -m prep SDfile
Find this compound or compounds like it in BindingDB:
Activity Spreadsheet -- Enzyme Inhibition Constant Data from BindingDB
Found 1 hit for monomerid = 93990
TargetEndothelial PAS domain-containing protein 1(Homo sapiens (Human))
Burnham Center For Chemical Genomics
Curated by PubChem BioAssay
LigandPNGBDBM93990(3-[2-(4-chlorophenyl)-5,7-dimethyl-6-pyrazolo[1,5-...)
Affinity DataIC50:  344nM
Ligand InfoPC cidPC sid
In DepthDetails PCBioAssay