BDBM94023 Fast Bordeaux 3B base::MLS000736833::N-(4-amino-2-chloro-5-methyl-phenyl)benzamide::N-(4-amino-2-chloro-5-methylphenyl)benzamide::N-(4-azanyl-2-chloranyl-5-methyl-phenyl)benzamide::SMR000528342::cid_67133
SMILES Cc1cc(NC(=O)c2ccccc2)c(Cl)cc1N
InChI Key InChIKey=OIDXADKOPPNJOB-UHFFFAOYSA-N
Data  1 IC50
  Tab Delimited (TSV)   2D SDfile   Computed 3D by Vconf -m prep SDfile
Find this compound or compounds like it in BindingDB:
Activity Spreadsheet -- Enzyme Inhibition Constant Data from BindingDB
Found 1 hit for monomerid = 94023
TargetEndothelial PAS domain-containing protein 1(Homo sapiens (Human))
Burnham Center For Chemical Genomics
Curated by PubChem BioAssay
LigandPNGBDBM94023(Fast Bordeaux 3B base | MLS000736833 | N-(4-amino-...)
Affinity DataIC50:  2.75E+3nM
In DepthDetails PCBioAssay