BDBM94093 2-[[4-allyl-5-(4-pyridyl)-1,2,4-triazol-3-yl]thio]-N-[5-(4-bromobenzyl)thiazol-2-yl]acetamide::2-{[4-allyl-5-(4-pyridinyl)-4H-1,2,4-triazol-3-yl]thio}-N-[5-(4-bromobenzyl)-1,3-thiazol-2-yl]acetamide::MLS000582802::N-[5-[(4-bromophenyl)methyl]-1,3-thiazol-2-yl]-2-[(4-prop-2-enyl-5-pyridin-4-yl-1,2,4-triazol-3-yl)sulfanyl]acetamide::N-[5-[(4-bromophenyl)methyl]-1,3-thiazol-2-yl]-2-[(4-prop-2-enyl-5-pyridin-4-yl-1,2,4-triazol-3-yl)sulfanyl]ethanamide::N-[5-[(4-bromophenyl)methyl]-2-thiazolyl]-2-[(4-prop-2-enyl-5-pyridin-4-yl-1,2,4-triazol-3-yl)thio]acetamide::SMR000201506::cid_1187786
SMILES Brc1ccc(Cc2cnc(NC(=O)CSc3nnc(-c4ccncc4)n3CC=C)s2)cc1
InChI Key InChIKey=TZKSWEUGHXZJOL-UHFFFAOYSA-N
Data  1 IC50
  Tab Delimited (TSV)   2D SDfile   Computed 3D by Vconf -m prep SDfile
Find this compound or compounds like it in BindingDB:
Activity Spreadsheet -- Enzyme Inhibition Constant Data from BindingDB
Found 1 hit for monomerid = 94093
TargetNeuropilin-1(Homo sapiens (Human))
Burnham Center For Chemical Genomics
Curated by PubChem BioAssay
LigandPNGBDBM94093(2-[[4-allyl-5-(4-pyridyl)-1,2,4-triazol-3-yl]thio]...)
Affinity DataIC50: >9.50E+4nM
In DepthDetails PCBioAssay