BDBM94346 (3,3-dimethyl-2-oxidanylidene-butyl) 2-pyridin-4-ylquinoline-4-carboxylate::(3,3-dimethyl-2-oxobutyl) 2-pyridin-4-ylquinoline-4-carboxylate::2-(4-pyridyl)cinchoninic acid (2-keto-3,3-dimethyl-butyl) ester::2-pyridin-4-yl-4-quinolinecarboxylic acid (3,3-dimethyl-2-oxobutyl) ester::MLS000516671::SMR000342804::cid_2435952
SMILES CC(C)(C)C(=O)COC(=O)c1cc(nc2ccccc12)-c1ccncc1
InChI Key InChIKey=QIDGXUMBRJBSKY-UHFFFAOYSA-N
Data  1 IC50
  Tab Delimited (TSV)   2D SDfile   Computed 3D by Vconf -m prep SDfile
Find this compound or compounds like it in BindingDB:
Activity Spreadsheet -- Enzyme Inhibition Constant Data from BindingDB
Found 1 hit for monomerid = 94346
TargetNeuropilin-1(Homo sapiens (Human))
Burnham Center For Chemical Genomics
Curated by PubChem BioAssay
LigandPNGBDBM94346((3,3-dimethyl-2-oxidanylidene-butyl) 2-pyridin-4-y...)
Affinity DataIC50:  4.05E+4nM
In DepthDetails PCBioAssay