BDBM94584 MLS003674205::N-cyclohexyl-2-[3-(2-furanyl)-2-oxo-1-quinoxalinyl]-2-(4-quinolinyl)acetamide::N-cyclohexyl-2-[3-(2-furyl)-2-keto-quinoxalin-1-yl]-2-(4-quinolyl)acetamide::N-cyclohexyl-2-[3-(furan-2-yl)-2-oxidanylidene-quinoxalin-1-yl]-2-quinolin-4-yl-ethanamide::N-cyclohexyl-2-[3-(furan-2-yl)-2-oxoquinoxalin-1-yl]-2-quinolin-4-ylacetamide::SMR002353673::cid_53383330
SMILES O=C(NC1CCCCC1)C(c1ccnc2ccccc12)n1c2ccccc2nc(-c2ccco2)c1=O
InChI Key InChIKey=NKWAKSKXGBMTML-UHFFFAOYSA-N
Data  3 IC50
  Tab Delimited (TSV)   2D SDfile   Computed 3D by Vconf -m prep SDfile
Find this compound or compounds like it in BindingDB:
Activity Spreadsheet -- Enzyme Inhibition Constant Data from BindingDB
Found 3 hits for monomerid = 94584
TargetHepatocyte nuclear factor 4-alpha(Homo sapiens (Human))
The Scripps Research Institute Molecular Screening Center
Curated by PubChem BioAssay
LigandPNGBDBM94584(MLS003674205 | N-cyclohexyl-2-[3-(2-furanyl)-2-oxo...)
Affinity DataIC50:  2.23E+3nM
In DepthDetails PCBioAssay
TargetPerilipin-5(Homo sapiens (Human))
The Scripps Research Institute Molecular Screening Center
Curated by PubChem BioAssay
LigandPNGBDBM94584(MLS003674205 | N-cyclohexyl-2-[3-(2-furanyl)-2-oxo...)
Affinity DataIC50:  1.66E+3nM
In DepthDetails PCBioAssay
TargetPerilipin-1(Homo sapiens (Human))
The Scripps Research Institute Molecular Screening Center
Curated by PubChem BioAssay
LigandPNGBDBM94584(MLS003674205 | N-cyclohexyl-2-[3-(2-furanyl)-2-oxo...)
Affinity DataIC50:  2.25E+3nM
In DepthDetails PCBioAssay