BDBM94678 (3-{[2-(Quinolin-8-yloxy)-acetyl]-hydrazonomethyl}-indol-1-yl)-acetic acid methyl ester::2-[3-[(E)-[[1-oxo-2-(8-quinolinyloxy)ethyl]hydrazinylidene]methyl]-1-indolyl]acetic acid methyl ester::2-[3-[(E)-[[2-(8-quinolyloxy)acetyl]hydrazono]methyl]indol-1-yl]acetic acid methyl ester::MLS000331592::SMR000220640::cid_6888053::methyl 2-[3-[(E)-(2-quinolin-8-yloxyethanoylhydrazinylidene)methyl]indol-1-yl]ethanoate::methyl 2-[3-[(E)-[(2-quinolin-8-yloxyacetyl)hydrazinylidene]methyl]indol-1-yl]acetate
SMILES COC(=O)Cn1cc(\C=N\NC(=O)COc2cccc3cccnc23)c2ccccc12
InChI Key InChIKey=YMWPUFARMXBPQC-BRJLIKDPSA-N
Data  1 IC50
  Tab Delimited (TSV)   2D SDfile   Computed 3D by Vconf -m prep SDfile
Find this compound or compounds like it in BindingDB:
Activity Spreadsheet -- Enzyme Inhibition Constant Data from BindingDB
Found 1 hit for monomerid = 94678
TargetADP-ribosylation factor GTPase-activating protein 1(Rattus norvegicus)
The Scripps Research Institute Molecular Screening Center
Curated by PubChem BioAssay
LigandPNGBDBM94678((3-{[2-(Quinolin-8-yloxy)-acetyl]-hydrazonomethyl}...)
Affinity DataIC50:  1.19E+5nM
In DepthDetails PCBioAssay