BDBM94753 6-methyl-2-[[4-(3-methylpiperidin-1-yl)sulfonylbenzoyl]amino]-5,7-dihydro-4H-thieno[2,3-c]pyridine-3-carboxamide::6-methyl-2-[[4-(3-methylpiperidin-1-yl)sulfonylphenyl]carbonylamino]-5,7-dihydro-4H-thieno[2,3-c]pyridine-3-carboxamide::6-methyl-2-[[4-(3-methylpiperidino)sulfonylbenzoyl]amino]-5,7-dihydro-4H-thieno[2,3-c]pyridine-3-carboxamide::6-methyl-2-[[[4-[(3-methyl-1-piperidinyl)sulfonyl]phenyl]-oxomethyl]amino]-5,7-dihydro-4H-thieno[2,3-c]pyridine-3-carboxamide::MLS001167759::SMR000805815::cid_5064431
SMILES CC1CCCN(C1)S(=O)(=O)c1ccc(cc1)C(=O)Nc1sc2CN(C)CCc2c1C(N)=O
InChI Key InChIKey=DHZAFPPAOWNXBI-UHFFFAOYSA-N
Data  1 EC50
  Tab Delimited (TSV)   2D SDfile   Computed 3D by Vconf -m prep SDfile
Find this compound or compounds like it in BindingDB:
Activity Spreadsheet -- Enzyme Inhibition Constant Data from BindingDB
Found 1 hit for monomerid = 94753
TargetXylosyl- and glucuronyltransferase LARGE1(Homo sapiens (Human))
Burnham Center For Chemical Genomics
Curated by PubChem BioAssay
LigandPNGBDBM94753(6-methyl-2-[[4-(3-methylpiperidin-1-yl)sulfonylben...)
Affinity DataEC50:  1.23E+4nM
In DepthDetails PCBioAssay