BDBM94769 4-[3-(cyclohexylmethyl)-2-imidazo[2,1-a]isoquinolinyl]benzonitrile::4-[3-(cyclohexylmethyl)imidaz[2,1-a]isoquinolin-2-yl]benzonitrile::4-[3-(cyclohexylmethyl)imidazo[2,1-a]isoquinolin-2-yl]benzenecarbonitrile::4-[3-(cyclohexylmethyl)imidazo[2,1-a]isoquinolin-2-yl]benzonitrile::MLS003222270::SMR001906825::cid_53299374
SMILES N#Cc1ccc(cc1)-c1nc2c3ccccc3ccn2c1CC1CCCCC1
InChI Key InChIKey=MEYXEALYPQEAPY-UHFFFAOYSA-N
Data  1 EC50
  Tab Delimited (TSV)   2D SDfile   Computed 3D by Vconf -m prep SDfile
Find this compound or compounds like it in BindingDB:
Activity Spreadsheet -- Enzyme Inhibition Constant Data from BindingDB
Found 1 hit for monomerid = 94769
TargetXylosyl- and glucuronyltransferase LARGE1(Homo sapiens (Human))
Burnham Center For Chemical Genomics
Curated by PubChem BioAssay
LigandPNGBDBM94769(4-[3-(cyclohexylmethyl)-2-imidazo[2,1-a]isoquinoli...)
Affinity DataEC50:  7.97E+3nM
In DepthDetails PCBioAssay