BDBM94785 Benzo[cd]indol-2-yl-(4-methoxy-phenyl)-amine::MLS000566863::N-(4-methoxyphenyl)-2-benzo[cd]indolamine::N-(4-methoxyphenyl)benzo[cd]indol-2-amine::SMR000176762::benzo[cd]indol-2-yl-(4-methoxyphenyl)amine::cid_759535
SMILES COc1ccc(NC2=Nc3cccc4cccc2c34)cc1
InChI Key InChIKey=MJPNDTUCRKKJRX-UHFFFAOYSA-N
Data  2 IC50
  Tab Delimited (TSV)   2D SDfile   Computed 3D by Vconf -m prep SDfile
Find this compound or compounds like it in BindingDB:
Activity Spreadsheet -- Enzyme Inhibition Constant Data from BindingDB
Found 2 hits for monomerid = 94785
TargetSentrin-specific protease 1(Homo sapiens (Human))
Burnham Center For Chemical Genomics
Curated by PubChem BioAssay
LigandPNGBDBM94785(Benzo[cd]indol-2-yl-(4-methoxy-phenyl)-amine | MLS...)
Affinity DataIC50:  4.58E+4nM
In DepthDetails PCBioAssay
TargetSentrin-specific protease 1(Homo sapiens (Human))
Burnham Center For Chemical Genomics
Curated by PubChem BioAssay
LigandPNGBDBM94785(Benzo[cd]indol-2-yl-(4-methoxy-phenyl)-amine | MLS...)
Affinity DataIC50:  1.00E+4nM
In DepthDetails PCBioAssay