BDBM94795 (6E)-6-[[[4-(2-furanyl)-2-(3-pyridinylimino)-3-thiazolyl]amino]methylidene]-4-methoxy-1-cyclohexa-2,4-dienone::(6E)-6-[[[4-(2-furyl)-2-(3-pyridylimino)-4-thiazolin-3-yl]amino]methylene]-4-methoxy-cyclohexa-2,4-dien-1-one::(6E)-6-[[[4-(furan-2-yl)-2-pyridin-3-ylimino-1,3-thiazol-3-yl]amino]methylidene]-4-methoxy-cyclohexa-2,4-dien-1-one::(6E)-6-[[[4-(furan-2-yl)-2-pyridin-3-ylimino-1,3-thiazol-3-yl]amino]methylidene]-4-methoxycyclohexa-2,4-dien-1-one::MLS000417017::SMR000241891::cid_6511422
SMILES COc1ccc(O)c(C=Nn2c(csc2=Nc2cccnc2)-c2ccco2)c1
InChI Key InChIKey=MWZIOKXOSPAGBC-UHFFFAOYSA-N
Data  2 IC50
  Tab Delimited (TSV)   2D SDfile   Computed 3D by Vconf -m prep SDfile
Find this compound or compounds like it in BindingDB:
Activity Spreadsheet -- Enzyme Inhibition Constant Data from BindingDB
Found 2 hits for monomerid = 94795
TargetSentrin-specific protease 1(Homo sapiens (Human))
Burnham Center For Chemical Genomics
Curated by PubChem BioAssay
LigandPNGBDBM94795((6E)-6-[[[4-(2-furanyl)-2-(3-pyridinylimino)-3-thi...)
Affinity DataIC50:  4.97E+4nM
In DepthDetails PCBioAssay
TargetSentrin-specific protease 1(Homo sapiens (Human))
Burnham Center For Chemical Genomics
Curated by PubChem BioAssay
LigandPNGBDBM94795((6E)-6-[[[4-(2-furanyl)-2-(3-pyridinylimino)-3-thi...)
Affinity DataIC50:  2.31E+4nM
In DepthDetails PCBioAssay