BDBM94826 (2E)-2-[(2E)-2-(3-bromanyl-6-oxidanylidene-cyclohexa-2,4-dien-1-ylidene)ethylidene]-3-ethyl-1H-quinazolin-4-one::(2E)-2-[(2E)-2-(3-bromo-6-keto-cyclohexa-2,4-dien-1-ylidene)ethylidene]-3-ethyl-1H-quinazolin-4-one::(2E)-2-[(2E)-2-(3-bromo-6-oxo-1-cyclohexa-2,4-dienylidene)ethylidene]-3-ethyl-1H-quinazolin-4-one::(2E)-2-[(2E)-2-(3-bromo-6-oxocyclohexa-2,4-dien-1-ylidene)ethylidene]-3-ethyl-1H-quinazolin-4-one::2-[2-(5-Bromo-2-hydroxy-phenyl)-vinyl]-3-ethyl-3H-quinazolin-4-one::MLS001205008::SMR000516957::cid_5763899
SMILES CCn1c(C=Cc2cc(Br)ccc2O)nc2ccccc2c1=O
InChI Key InChIKey=KQAOKFBKVJSZRN-UHFFFAOYSA-N
Data  2 IC50
  Tab Delimited (TSV)   2D SDfile   Computed 3D by Vconf -m prep SDfile
Find this compound or compounds like it in BindingDB:
Activity Spreadsheet -- Enzyme Inhibition Constant Data from BindingDB
Found 2 hits for monomerid = 94826
TargetSentrin-specific protease 1(Homo sapiens (Human))
Burnham Center For Chemical Genomics
Curated by PubChem BioAssay
LigandPNGBDBM94826((2E)-2-[(2E)-2-(3-bromanyl-6-oxidanylidene-cyclohe...)
Affinity DataIC50:  1.25E+4nM
In DepthDetails PCBioAssay
TargetSentrin-specific protease 1(Homo sapiens (Human))
Burnham Center For Chemical Genomics
Curated by PubChem BioAssay
LigandPNGBDBM94826((2E)-2-[(2E)-2-(3-bromanyl-6-oxidanylidene-cyclohe...)
Affinity DataIC50:  5.90E+3nM
In DepthDetails PCBioAssay