BDBM94842 3-amino-N-cyclohexyl-3-[2-(2-methoxyanilino)-2-oxoethoxy]iminopropanamide::3-amino-N-cyclohexyl-3-[2-keto-2-(o-anisidino)ethyl]oximino-propionamide::3-azanyl-N-cyclohexyl-3-[2-[(2-methoxyphenyl)amino]-2-oxidanylidene-ethoxy]imino-propanamide::MLS002164419::SMR001246792::cid_25163694
SMILES COc1ccccc1NC(=O)CONC(=N)CC(=O)NC1CCCCC1
InChI Key InChIKey=BGXOMGFGDNSCQU-UHFFFAOYSA-N
Data  2 IC50
  Tab Delimited (TSV)   2D SDfile   Computed 3D by Vconf -m prep SDfile
Find this compound or compounds like it in BindingDB:
Activity Spreadsheet -- Enzyme Inhibition Constant Data from BindingDB
Found 2 hits for monomerid = 94842
TargetSentrin-specific protease 1(Homo sapiens (Human))
Burnham Center For Chemical Genomics
Curated by PubChem BioAssay
LigandPNGBDBM94842(3-amino-N-cyclohexyl-3-[2-(2-methoxyanilino)-2-oxo...)
Affinity DataIC50:  1.41E+4nM
Ligand InfoPC cidPC sid
In DepthDetails PCBioAssay
TargetSentrin-specific protease 1(Homo sapiens (Human))
Burnham Center For Chemical Genomics
Curated by PubChem BioAssay
LigandPNGBDBM94842(3-amino-N-cyclohexyl-3-[2-(2-methoxyanilino)-2-oxo...)
Affinity DataIC50:  1.25E+4nM
Ligand InfoPC cidPC sid
In DepthDetails PCBioAssay