BDBM94848 6-(4-morpholinyl)-9,10,10-trioxo-N-[[(2S)-2-oxolanyl]methyl]-1-thioxanthenecarboxamide::6-morpholin-4-yl-9,10,10-trioxo-N-[[(2S)-oxolan-2-yl]methyl]thioxanthene-1-carboxamide::6-morpholin-4-yl-9,10,10-tris(oxidanylidene)-N-[[(2S)-oxolan-2-yl]methyl]thioxanthene-1-carboxamide::9,10,10-triketo-6-morpholino-N-[[(2S)-tetrahydrofuran-2-yl]methyl]thioxanthene-1-carboxamide::MLS002472257::SMR001395408::cid_44144181
SMILES O=C(NC[C@@H]1CCCO1)c1cccc2c1C(=O)c1ccc(cc1S2(=O)=O)N1CCOCC1
InChI Key InChIKey=BSDXEAKWYDRBCL-INIZCTEOSA-N
Data  2 IC50
  Tab Delimited (TSV)   2D SDfile   Computed 3D by Vconf -m prep SDfile
Find this compound or compounds like it in BindingDB:
Activity Spreadsheet -- Enzyme Inhibition Constant Data from BindingDB
Found 2 hits for monomerid = 94848
TargetSentrin-specific protease 1(Homo sapiens (Human))
Burnham Center For Chemical Genomics
Curated by PubChem BioAssay
LigandPNGBDBM94848(6-(4-morpholinyl)-9,10,10-trioxo-N-[[(2S)-2-oxolan...)
Affinity DataIC50:  1.20E+4nM
In DepthDetails PCBioAssay
TargetSentrin-specific protease 1(Homo sapiens (Human))
Burnham Center For Chemical Genomics
Curated by PubChem BioAssay
LigandPNGBDBM94848(6-(4-morpholinyl)-9,10,10-trioxo-N-[[(2S)-2-oxolan...)
Affinity DataIC50:  1.64E+4nM
In DepthDetails PCBioAssay