BDBM94895 (2R)-2-[(5-methyl-2-phenyl-4-quinazolinyl)amino]-2-phenylethanol::(2R)-2-[(5-methyl-2-phenyl-quinazolin-4-yl)amino]-2-phenyl-ethanol::(2R)-2-[(5-methyl-2-phenylquinazolin-4-yl)amino]-2-phenylethanol::MLS000699293::SMR000229282::cid_1230862
SMILES Cc1cccc2nc(nc(N[C@@H](CO)c3ccccc3)c12)-c1ccccc1
InChI Key InChIKey=DENDJETVVNZZEF-FQEVSTJZSA-N
Data  3 IC50
  Tab Delimited (TSV)   2D SDfile   Computed 3D by Vconf -m prep SDfile
Find this compound or compounds like it in BindingDB:
Activity Spreadsheet -- Enzyme Inhibition Constant Data from BindingDB
Found 3 hits for monomerid = 94895
TargetLow molecular weight phosphotyrosine protein phosphatase(Homo sapiens (Human))
Burnham Center For Chemical Genomics
Curated by PubChem BioAssay
LigandPNGBDBM94895((2R)-2-[(5-methyl-2-phenyl-4-quinazolinyl)amino]-2...)
Affinity DataIC50:  1.70E+4nM
In DepthDetails PCBioAssay
TargetTyrosine-protein phosphatase non-receptor type 22(Homo sapiens (Human))
Burnham Center For Chemical Genomics
Curated by PubChem BioAssay
LigandPNGBDBM94895((2R)-2-[(5-methyl-2-phenyl-4-quinazolinyl)amino]-2...)
Affinity DataIC50: >8.00E+4nM
In DepthDetails PCBioAssay
TargetLow molecular weight phosphotyrosine protein phosphatase(Homo sapiens (Human))
Burnham Center For Chemical Genomics
Curated by PubChem BioAssay
LigandPNGBDBM94895((2R)-2-[(5-methyl-2-phenyl-4-quinazolinyl)amino]-2...)
Affinity DataIC50: >8.00E+4nM
In DepthDetails PCBioAssay