BDBM94973 MLS000708474::N-(2-pyridin-4-yl-1,3-benzoxazol-5-yl)-1,3-benzodioxole-5-carboxamide::N-[2-(4-pyridyl)-1,3-benzoxazol-5-yl]-piperonylamide::SMR000287941::cid_2211690
SMILES O=C(Nc1ccc2oc(nc2c1)-c1ccncc1)c1ccc2OCOc2c1
InChI Key InChIKey=CVJASUZAFHGTTF-UHFFFAOYSA-N
Data  2 IC50
  Tab Delimited (TSV)   2D SDfile   Computed 3D by Vconf -m prep SDfile
Find this compound or compounds like it in BindingDB:
Activity Spreadsheet -- Enzyme Inhibition Constant Data from BindingDB
Found 2 hits for monomerid = 94973
TargetLow molecular weight phosphotyrosine protein phosphatase(Homo sapiens (Human))
Burnham Center For Chemical Genomics
Curated by PubChem BioAssay
LigandPNGBDBM94973(MLS000708474 | N-(2-pyridin-4-yl-1,3-benzoxazol-5-...)
Affinity DataIC50: >8.00E+4nM
In DepthDetails PCBioAssay
TargetLow molecular weight phosphotyrosine protein phosphatase(Homo sapiens (Human))
Burnham Center For Chemical Genomics
Curated by PubChem BioAssay
LigandPNGBDBM94973(MLS000708474 | N-(2-pyridin-4-yl-1,3-benzoxazol-5-...)
Affinity DataIC50:  7.98E+3nM
In DepthDetails PCBioAssay