BDBM95039 MLS001164916::N-cyclopentyl-2-(2-fluorophenyl)-4-quinazolinamine::N-cyclopentyl-2-(2-fluorophenyl)quinazolin-4-amine::SMR000540154::cid_929654::cyclopentyl-[2-(2-fluorophenyl)quinazolin-4-yl]amine
SMILES Fc1ccccc1-c1nc(NC2CCCC2)c2ccccc2n1
InChI Key InChIKey=AFMHHHMLWNYSDD-UHFFFAOYSA-N
Data  3 IC50
  Tab Delimited (TSV)   2D SDfile   Computed 3D by Vconf -m prep SDfile
Find this compound or compounds like it in BindingDB:
Activity Spreadsheet -- Enzyme Inhibition Constant Data from BindingDB
Found 3 hits for monomerid = 95039
TargetLow molecular weight phosphotyrosine protein phosphatase(Homo sapiens (Human))
Burnham Center For Chemical Genomics
Curated by PubChem BioAssay
LigandPNGBDBM95039(MLS001164916 | N-cyclopentyl-2-(2-fluorophenyl)-4-...)
Affinity DataIC50:  7.48E+3nM
In DepthDetails PCBioAssay
TargetTyrosine-protein phosphatase non-receptor type 22(Homo sapiens (Human))
Burnham Center For Chemical Genomics
Curated by PubChem BioAssay
LigandPNGBDBM95039(MLS001164916 | N-cyclopentyl-2-(2-fluorophenyl)-4-...)
Affinity DataIC50: >8.00E+4nM
In DepthDetails PCBioAssay
TargetLow molecular weight phosphotyrosine protein phosphatase(Homo sapiens (Human))
Burnham Center For Chemical Genomics
Curated by PubChem BioAssay
LigandPNGBDBM95039(MLS001164916 | N-cyclopentyl-2-(2-fluorophenyl)-4-...)
Affinity DataIC50:  1.31E+4nM
In DepthDetails PCBioAssay