BDBM95040 4-[4-(3,4-dichlorophenyl)sulfonyl-1-piperazinyl]-2-methylquinoline::4-[4-(3,4-dichlorophenyl)sulfonylpiperazin-1-yl]-2-methyl-quinoline::4-[4-(3,4-dichlorophenyl)sulfonylpiperazin-1-yl]-2-methylquinoline::4-[4-(3,4-dichlorophenyl)sulfonylpiperazino]-2-methyl-quinoline::4-{4-[(3,4-dichlorophenyl)sulfonyl]-1-piperazinyl}-2-methylquinoline::MLS000621446::SMR000299527::cid_1003680
SMILES Cc1cc(N2CCN(CC2)S(=O)(=O)c2ccc(Cl)c(Cl)c2)c2ccccc2n1
InChI Key InChIKey=ZTRKDZCGXASXFH-UHFFFAOYSA-N
Data  3 IC50
  Tab Delimited (TSV)   2D SDfile   Computed 3D by Vconf -m prep SDfile
Find this compound or compounds like it in BindingDB:
Activity Spreadsheet -- Enzyme Inhibition Constant Data from BindingDB
Found 3 hits for monomerid = 95040
TargetLow molecular weight phosphotyrosine protein phosphatase(Homo sapiens (Human))
Burnham Center For Chemical Genomics
Curated by PubChem BioAssay
LigandPNGBDBM95040(4-[4-(3,4-dichlorophenyl)sulfonyl-1-piperazinyl]-2...)
Affinity DataIC50:  1.95E+4nM
In DepthDetails PCBioAssay
TargetTyrosine-protein phosphatase non-receptor type 22(Homo sapiens (Human))
Burnham Center For Chemical Genomics
Curated by PubChem BioAssay
LigandPNGBDBM95040(4-[4-(3,4-dichlorophenyl)sulfonyl-1-piperazinyl]-2...)
Affinity DataIC50:  3.58E+4nM
In DepthDetails PCBioAssay
TargetLow molecular weight phosphotyrosine protein phosphatase(Homo sapiens (Human))
Burnham Center For Chemical Genomics
Curated by PubChem BioAssay
LigandPNGBDBM95040(4-[4-(3,4-dichlorophenyl)sulfonyl-1-piperazinyl]-2...)
Affinity DataIC50: >8.00E+4nM
In DepthDetails PCBioAssay