BDBM95062 (3-Isopropoxy-propyl)-(2-phenyl-quinazolin-4-yl)-amine::2-phenyl-N-(3-propan-2-yloxypropyl)-4-quinazolinamine;hydrochloride::2-phenyl-N-(3-propan-2-yloxypropyl)quinazolin-4-amine;hydrochloride::3-isopropoxypropyl-(2-phenylquinazolin-4-yl)amine;hydrochloride::MLS001206389::SMR000523199::cid_2792397
SMILES CC(C)OCCCNc1nc(nc2ccccc12)-c1ccccc1
InChI Key InChIKey=CIJJQCWJPGDRRB-UHFFFAOYSA-N
Data  3 IC50
  Tab Delimited (TSV)   2D SDfile   Computed 3D by Vconf -m prep SDfile
Find this compound or compounds like it in BindingDB:
Activity Spreadsheet -- Enzyme Inhibition Constant Data from BindingDB
Found 3 hits for monomerid = 95062
TargetLow molecular weight phosphotyrosine protein phosphatase(Homo sapiens (Human))
Burnham Center For Chemical Genomics
Curated by PubChem BioAssay
LigandPNGBDBM95062((3-Isopropoxy-propyl)-(2-phenyl-quinazolin-4-yl)-a...)
Affinity DataIC50:  1.17E+4nM
In DepthDetails PCBioAssay
TargetTyrosine-protein phosphatase non-receptor type 22(Homo sapiens (Human))
Burnham Center For Chemical Genomics
Curated by PubChem BioAssay
LigandPNGBDBM95062((3-Isopropoxy-propyl)-(2-phenyl-quinazolin-4-yl)-a...)
Affinity DataIC50: >8.00E+4nM
In DepthDetails PCBioAssay
TargetLow molecular weight phosphotyrosine protein phosphatase(Homo sapiens (Human))
Burnham Center For Chemical Genomics
Curated by PubChem BioAssay
LigandPNGBDBM95062((3-Isopropoxy-propyl)-(2-phenyl-quinazolin-4-yl)-a...)
Affinity DataIC50:  2.29E+4nM
In DepthDetails PCBioAssay