BDBM95096 5-bromanyl-N-[2-(3-methylphenyl)-4,6-dihydrothieno[3,4-c]pyrazol-3-yl]furan-2-carboxamide::5-bromo-N-[2-(3-methylphenyl)-2,6-dihydro-4H-thieno[3,4-c]pyrazol-3-yl]-2-furamide::5-bromo-N-[2-(3-methylphenyl)-4,6-dihydrothieno[3,4-c]pyrazol-3-yl]-2-furancarboxamide::5-bromo-N-[2-(3-methylphenyl)-4,6-dihydrothieno[3,4-c]pyrazol-3-yl]furan-2-carboxamide::5-bromo-N-[2-(m-tolyl)-4,6-dihydrothieno[3,4-c]pyrazol-3-yl]-2-furamide::MLS000087837::SMR000024157::cid_3235687
SMILES Cc1cccc(c1)-n1nc2CSCc2c1NC(=O)c1ccc(Br)o1
InChI Key InChIKey=VBDDXCZQKYSHHW-UHFFFAOYSA-N
Data  1 IC50
  Tab Delimited (TSV)   2D SDfile   Computed 3D by Vconf -m prep SDfile
Find this compound or compounds like it in BindingDB:
Activity Spreadsheet -- Enzyme Inhibition Constant Data from BindingDB
Found 1 hit for monomerid = 95096
TargetProbable nicotinate-nucleotide adenylyltransferase(Staphylococcus aureus subsp. aureus N315)
Burnham Center For Chemical Genomics
Curated by PubChem BioAssay
LigandPNGBDBM95096(5-bromanyl-N-[2-(3-methylphenyl)-4,6-dihydrothieno...)
Affinity DataIC50:  1.75E+4nM
In DepthDetails PCBioAssay