BDBM95199 MLS000581946::N-[2-methoxy-5-(2-oxidanylidenechromen-3-yl)phenyl]pyridine-3-carboxamide::N-[2-methoxy-5-(2-oxo-1-benzopyran-3-yl)phenyl]-3-pyridinecarboxamide::N-[2-methoxy-5-(2-oxo-2H-chromen-3-yl)phenyl]nicotinamide::N-[2-methoxy-5-(2-oxochromen-3-yl)phenyl]pyridine-3-carboxamide::N-[5-(2-ketochromen-3-yl)-2-methoxy-phenyl]nicotinamide::SMR000200554::cid_1254455
SMILES COc1ccc(cc1NC(=O)c1cccnc1)-c1cc2ccccc2oc1=O
InChI Key InChIKey=RNNHMEZTWPUAJR-UHFFFAOYSA-N
Data  1 IC50
  Tab Delimited (TSV)   2D SDfile   Computed 3D by Vconf -m prep SDfile
Find this compound or compounds like it in BindingDB:
Activity Spreadsheet -- Enzyme Inhibition Constant Data from BindingDB
Found 1 hit for monomerid = 95199
TargetADP-ribosylation factor GTPase-activating protein 1(Rattus norvegicus)
The Scripps Research Institute Molecular Screening Center
Curated by PubChem BioAssay
LigandPNGBDBM95199(MLS000581946 | N-[2-methoxy-5-(2-oxidanylidenechro...)
Affinity DataIC50: >1.65E+5nM
In DepthDetails PCBioAssay