BDBM95234 MLS001138350::SMR000709422::cid_7599035
SMILES COCCCn1c(C)cc(C(=O)CN2c3cccc4cccc(c34)S2(=O)=O)c1C
InChI Key InChIKey=STHKJIKQUBATLH-UHFFFAOYSA-N
Data  1 IC50
  Tab Delimited (TSV)   2D SDfile   Computed 3D by Vconf -m prep SDfile
Find this compound or compounds like it in BindingDB:
Activity Spreadsheet -- Enzyme Inhibition Constant Data from BindingDB
Found 1 hit for monomerid = 95234
TargetADP-ribosylation factor GTPase-activating protein 1(Rattus norvegicus)
The Scripps Research Institute Molecular Screening Center
Curated by PubChem BioAssay
LigandPNGBDBM95234(MLS001138350 | SMR000709422 | cid_7599035)
Affinity DataIC50:  6.02E+4nM
In DepthDetails PCBioAssay