BDBM95293 1-phenyl-2H-pyrazolo[3,4-d]pyrimidine-4-thione::MLS001181824::SMR000528049::cid_722392
SMILES S=c1[nH]cnc2n(ncc12)-c1ccccc1
InChI Key InChIKey=ZWJJSSALBGCODZ-UHFFFAOYSA-N
Data  3 IC50
  Tab Delimited (TSV)   2D SDfile   Computed 3D by Vconf -m prep SDfile
Find this compound or compounds like it in BindingDB:
Activity Spreadsheet -- Enzyme Inhibition Constant Data from BindingDB
Found 3 hits for monomerid = 95293
TargetEnvelope glycoprotein gp160(Human immunodeficiency virus type 1 group M subtyp...)
The Scripps Research Institute Molecular Screening Center
Curated by PubChem BioAssay
LigandPNGBDBM95293(1-phenyl-2H-pyrazolo[3,4-d]pyrimidine-4-thione | M...)
Affinity DataIC50: >6.71E+4nM
In DepthDetails PCBioAssay
TargetEnvelope glycoprotein gp160(Human immunodeficiency virus type 1 group M subtyp...)
The Scripps Research Institute Molecular Screening Center
Curated by PubChem BioAssay
LigandPNGBDBM95293(1-phenyl-2H-pyrazolo[3,4-d]pyrimidine-4-thione | M...)
Affinity DataIC50: >6.71E+4nM
In DepthDetails PCBioAssay
TargetEnvelope glycoprotein gp160(Human immunodeficiency virus type 1 group M subtyp...)
The Scripps Research Institute Molecular Screening Center
Curated by PubChem BioAssay
LigandPNGBDBM95293(1-phenyl-2H-pyrazolo[3,4-d]pyrimidine-4-thione | M...)
Affinity DataIC50: >6.71E+4nM
In DepthDetails PCBioAssay