BDBM95475 2-ethoxy-N-(4-{[(2-phenylethyl)amino]sulfonyl}phenyl)acetamide::2-ethoxy-N-[4-(2-phenylethylsulfamoyl)phenyl]acetamide::2-ethoxy-N-[4-(2-phenylethylsulfamoyl)phenyl]ethanamide::2-ethoxy-N-[4-(phenethylsulfamoyl)phenyl]acetamide::MLS000049178::SMR000074897::cid_2162790
SMILES CCOCC(=O)Nc1ccc(cc1)S(=O)(=O)NCCc1ccccc1
InChI Key InChIKey=IGXNPZLDPCPEKD-UHFFFAOYSA-N
Data  2 IC50
  Tab Delimited (TSV)   2D SDfile   Computed 3D by Vconf -m prep SDfile
Find this compound or compounds like it in BindingDB:
Activity Spreadsheet -- Enzyme Inhibition Constant Data from BindingDB
Found 2 hits for monomerid = 95475
TargetTegument protein VP16(Human herpesvirus 1 (strain 17) (HHV-1) (Human her...)
The Scripps Research Institute Molecular Screening Center
Curated by PubChem BioAssay
LigandPNGBDBM95475(2-ethoxy-N-(4-{[(2-phenylethyl)amino]sulfonyl}phen...)
Affinity DataIC50: >3.59E+4nM
In DepthDetails PCBioAssay
TargetNuclear receptor subfamily 5 group A member 2(Homo sapiens (Human))
The Scripps Research Institute Molecular Screening Center
Curated by PubChem BioAssay
LigandPNGBDBM95475(2-ethoxy-N-(4-{[(2-phenylethyl)amino]sulfonyl}phen...)
Affinity DataIC50:  1.84E+4nM
In DepthDetails PCBioAssay