BDBM95681 1-benzyl-6-keto-pyridazine-3-carboxylic acid [2-(2,3-dihydro-1,4-benzodioxin-6-ylamino)-2-keto-ethyl] ester::6-oxo-1-(phenylmethyl)-3-pyridazinecarboxylic acid [2-(2,3-dihydro-1,4-benzodioxin-6-ylamino)-2-oxoethyl] ester::MLS000098402::SMR000063974::[2-(2,3-dihydro-1,4-benzodioxin-6-ylamino)-2-oxidanylidene-ethyl] 6-oxidanylidene-1-(phenylmethyl)pyridazine-3-carboxylate::[2-(2,3-dihydro-1,4-benzodioxin-6-ylamino)-2-oxoethyl] 1-benzyl-6-oxopyridazine-3-carboxylate::cid_2128937
SMILES O=C(COC(=O)c1ccc(=O)n(Cc2ccccc2)n1)Nc1ccc2OCCOc2c1
InChI Key InChIKey=SCTWRBIECQKDFC-UHFFFAOYSA-N
Data  2 IC50
  Tab Delimited (TSV)   2D SDfile   Computed 3D by Vconf -m prep SDfile
Find this compound or compounds like it in BindingDB:
Activity Spreadsheet -- Enzyme Inhibition Constant Data from BindingDB
Found 2 hits for monomerid = 95681
TargetTegument protein VP16(Human herpesvirus 1 (strain 17) (HHV-1) (Human her...)
The Scripps Research Institute Molecular Screening Center
Curated by PubChem BioAssay
LigandPNGBDBM95681(1-benzyl-6-keto-pyridazine-3-carboxylic acid [2-(2...)
Affinity DataIC50: >3.59E+4nM
In DepthDetails PCBioAssay
TargetNuclear receptor subfamily 5 group A member 2(Homo sapiens (Human))
The Scripps Research Institute Molecular Screening Center
Curated by PubChem BioAssay
LigandPNGBDBM95681(1-benzyl-6-keto-pyridazine-3-carboxylic acid [2-(2...)
Affinity DataIC50: >3.59E+4nM
In DepthDetails PCBioAssay