BDBM95776 (2R,4R)-N-(1H-benzimidazol-2-ylmethyl)-4-tert-butyl-2-(4-methylolbenzyl)oxy-3,4-dihydro-2H-pyran-6-carboxamide::(2R,4R)-N-(1H-benzimidazol-2-ylmethyl)-4-tert-butyl-2-[[4-(hydroxymethyl)phenyl]methoxy]-3,4-dihydro-2H-pyran-6-carboxamide::MLS000849498::SMR000442142::cid_16745411
SMILES CC(C)(C)[C@@H]1C[C@H](OCc2ccc(CO)cc2)OC(=C1)C(=O)NCc1nc2ccccc2[nH]1
InChI Key InChIKey=JTUAEFMENMPEQU-YADARESESA-N
Data  1 IC50
  Tab Delimited (TSV)   2D SDfile   Computed 3D by Vconf -m prep SDfile
Find this compound or compounds like it in BindingDB:
Activity Spreadsheet -- Enzyme Inhibition Constant Data from BindingDB
Found 1 hit for monomerid = 95776
TargetMethionine--tRNA ligase(Trypanosoma brucei brucei strain 927/4 GUTat10.1)
The Scripps Research Institute Molecular Screening Center
Curated by PubChem BioAssay
LigandPNGBDBM95776((2R,4R)-N-(1H-benzimidazol-2-ylmethyl)-4-tert-buty...)
Affinity DataIC50:  1.99E+3nM
In DepthDetails PCBioAssay