BDBM95872 1-Nonyl-2,3,4,9-tetrahydro-1H-beta-carboline-3-carboxylic acid::1-nonyl-2,3,4,9-tetrahydro-1H-pyrido[3,4-b]indole-3-carboxylic acid::MLS001210998::SMR000504772::cid_3089152
SMILES CCCCCCCCCC1NC(Cc2c1[nH]c1ccccc21)C(O)=O
InChI Key InChIKey=CXNATEZOVVRARQ-UHFFFAOYSA-N
Data  1 IC50
  Tab Delimited (TSV)   2D SDfile   Computed 3D by Vconf -m prep SDfile
Find this compound or compounds like it in BindingDB:
Activity Spreadsheet -- Enzyme Inhibition Constant Data from BindingDB
Found 1 hit for monomerid = 95872
TargetMethionine--tRNA ligase(Trypanosoma brucei brucei strain 927/4 GUTat10.1)
The Scripps Research Institute Molecular Screening Center
Curated by PubChem BioAssay
LigandPNGBDBM95872(1-Nonyl-2,3,4,9-tetrahydro-1H-beta-carboline-3-car...)
Affinity DataIC50:  1.96E+3nM
In DepthDetails PCBioAssay