BDBM95954 3-methylbenzoic acid [2-ethoxy-4-[(Z)-[[4-(pivaloylamino)benzoyl]hydrazono]methyl]phenyl] ester::3-methylbenzoic acid [4-[(Z)-[[[4-[(2,2-dimethyl-1-oxopropyl)amino]phenyl]-oxomethyl]hydrazinylidene]methyl]-2-ethoxyphenyl] ester::4-(2-{4-[(2,2-dimethylpropanoyl)amino]benzoyl}carbohydrazonoyl)-2-ethoxyphenyl 3-methylbenzoate::MLS000544342::SMR000163785::[4-[(Z)-[[4-(2,2-dimethylpropanoylamino)benzoyl]hydrazinylidene]methyl]-2-ethoxyphenyl] 3-methylbenzoate::[4-[(Z)-[[4-(2,2-dimethylpropanoylamino)phenyl]carbonylhydrazinylidene]methyl]-2-ethoxy-phenyl] 3-methylbenzoate::cid_5569476
SMILES CCOc1cc(\C=N/NC(=O)c2ccc(NC(=O)C(C)(C)C)cc2)ccc1OC(=O)c1cccc(C)c1
InChI Key InChIKey=AEZPWELMVVEUDC-YKQZZPSBSA-N
Data  1 EC50
  Tab Delimited (TSV)   2D SDfile   Computed 3D by Vconf -m prep SDfile
Find this compound or compounds like it in BindingDB:
Activity Spreadsheet -- Enzyme Inhibition Constant Data from BindingDB
Found 1 hit for monomerid = 95954
TargetTumor necrosis factor receptor superfamily member 10B(Homo sapiens (Human))
Burnham Center For Chemical Genomics
Curated by PubChem BioAssay
LigandPNGBDBM95954(3-methylbenzoic acid [2-ethoxy-4-[(Z)-[[4-(pivaloy...)
Affinity DataEC50: >1.25E+4nM
In DepthDetails PCBioAssay