BDBM95961 2-(4-fluorophenyl)-5-phenyl-1H-pyrazolo[1,5-a]pyrimidin-7-one::2-(4-fluorophenyl)-5-phenylpyrazolo[1,5-a]pyrimidin-7-ol::MLS001178753::SMR000476259::cid_1232838
SMILES Fc1ccc(cc1)-c1cc2nc(cc(=O)n2[nH]1)-c1ccccc1
InChI Key InChIKey=IBTRHLNDPMKNFK-UHFFFAOYSA-N
Data  1 EC50
  Tab Delimited (TSV)   2D SDfile   Computed 3D by Vconf -m prep SDfile
Find this compound or compounds like it in BindingDB:
Activity Spreadsheet -- Enzyme Inhibition Constant Data from BindingDB
Found 1 hit for monomerid = 95961
TargetTumor necrosis factor receptor superfamily member 10B(Homo sapiens (Human))
Burnham Center For Chemical Genomics
Curated by PubChem BioAssay
LigandPNGBDBM95961(2-(4-fluorophenyl)-5-phenyl-1H-pyrazolo[1,5-a]pyri...)
Affinity DataEC50: >1.25E+4nM
In DepthDetails PCBioAssay