BDBM96016 MLS001385038::N'-(3,4-dichlorobenzoyl)-2,5-bis(2,2,2-trifluoroethoxy)benzenecarbohydrazide::N'-[2,5-bis(2,2,2-trifluoroethoxy)benzoyl]-3,4-dichloro-benzohydrazide::N'-[2,5-bis(2,2,2-trifluoroethoxy)benzoyl]-3,4-dichlorobenzohydrazide::N'-[2,5-bis[2,2,2-tris(fluoranyl)ethoxy]phenyl]carbonyl-3,4-bis(chloranyl)benzohydrazide::N'-[[2,5-bis(2,2,2-trifluoroethoxy)phenyl]-oxomethyl]-3,4-dichlorobenzohydrazide::SMR000179607::cid_3775722
SMILES FC(F)(F)COc1ccc(OCC(F)(F)F)c(c1)C(=O)NNC(=O)c1ccc(Cl)c(Cl)c1
InChI Key InChIKey=DJGNJJWNPCCCDA-UHFFFAOYSA-N
Data  1 EC50
  Tab Delimited (TSV)   2D SDfile   Computed 3D by Vconf -m prep SDfile
Find this compound or compounds like it in BindingDB:
Activity Spreadsheet -- Enzyme Inhibition Constant Data from BindingDB
Found 1 hit for monomerid = 96016
TargetTumor necrosis factor receptor superfamily member 10B(Homo sapiens (Human))
Burnham Center For Chemical Genomics
Curated by PubChem BioAssay
LigandPNGBDBM96016(MLS001385038 | N'-(3,4-dichlorobenzoyl)-2,5-bi...)
Affinity DataEC50: >1.25E+4nM
In DepthDetails PCBioAssay