BDBM96078 MLS000771884::N-[(E)-(5-methyl-2-furanyl)methylideneamino]-2-quinolinamine::N-[(E)-(5-methylfuran-2-yl)methylideneamino]quinolin-2-amine::SMR000344248::[(E)-(5-methyl-2-furyl)methyleneamino]-(2-quinolyl)amine::cid_9659222
SMILES Cc1ccc(CN=Nc2ccc3ccccc3n2)o1
InChI Key InChIKey=PMVMIEYYQUDRAQ-UHFFFAOYSA-N
Data  2 IC50  1 EC50
  Tab Delimited (TSV)   2D SDfile   Computed 3D by Vconf -m prep SDfile
Find this compound or compounds like it in BindingDB:
Activity Spreadsheet -- Enzyme Inhibition Constant Data from BindingDB
Found 3 hits for monomerid = 96078
TargetTumor necrosis factor receptor superfamily member 10B(Homo sapiens (Human))
Burnham Center For Chemical Genomics
Curated by PubChem BioAssay
LigandPNGBDBM96078(MLS000771884 | N-[(E)-(5-methyl-2-furanyl)methylid...)
Affinity DataEC50: >1.25E+4nM
Ligand InfoPC cidPC sid
In DepthDetails PCBioAssay
TargetSteroidogenic factor 1(Homo sapiens (Human))
The Scripps Research Institute Molecular Screening Center
Curated by PubChem BioAssay
LigandPNGBDBM96078(MLS000771884 | N-[(E)-(5-methyl-2-furanyl)methylid...)
Affinity DataIC50: >6.75E+4nM
Ligand InfoPC cidPC sid
In DepthDetails PCBioAssay
TargetNuclear receptor subfamily 0 group B member 1(Homo sapiens (Human))
The Scripps Research Institute Molecular Screening Center
Curated by PubChem BioAssay
LigandPNGBDBM96078(MLS000771884 | N-[(E)-(5-methyl-2-furanyl)methylid...)
Affinity DataIC50: >6.75E+4nM
Ligand InfoPC cidPC sid
In DepthDetails PCBioAssay