BDBM96110 2-(4-ethyl-7-methyl-2-oxidanylidene-chromen-5-yl)oxy-N-[1-(phenylmethyl)piperidin-4-yl]propanamide::2-[(4-ethyl-7-methyl-2-oxo-1-benzopyran-5-yl)oxy]-N-[1-(phenylmethyl)-4-piperidinyl]propanamide::MLS001158264::N-(1-benzyl-4-piperidyl)-2-(4-ethyl-2-keto-7-methyl-chromen-5-yl)oxy-propionamide::N-(1-benzylpiperidin-4-yl)-2-(4-ethyl-7-methyl-2-oxochromen-5-yl)oxypropanamide::SMR000652288::cid_4904637
SMILES CCc1cc(=O)oc2cc(C)cc(OC(C)C(=O)NC3CCN(Cc4ccccc4)CC3)c12
InChI Key InChIKey=ZJCGUSVVNCQQED-UHFFFAOYSA-N
Data  1 IC50
  Tab Delimited (TSV)   2D SDfile   Computed 3D by Vconf -m prep SDfile
Find this compound or compounds like it in BindingDB:
Activity Spreadsheet -- Enzyme Inhibition Constant Data from BindingDB
Found 1 hit for monomerid = 96110
TargetFructose-bisphosphate aldolase(Mycobacterium tuberculosis (strain H37Rv))
The Scripps Research Institute Molecular Screening Center
Curated by PubChem BioAssay
LigandPNGBDBM96110(2-(4-ethyl-7-methyl-2-oxidanylidene-chromen-5-yl)o...)
Affinity DataIC50:  1.52E+3nM
In DepthDetails PCBioAssay