BDBM96112 2-amino-4-cyclopropyl-6-phenyl-cyclohexa-1,3-diene-1,3-dicarbonitrile::2-amino-4-cyclopropyl-6-phenylcyclohexa-1,3-diene-1,3-dicarbonitrile::2-azanyl-4-cyclopropyl-6-phenyl-cyclohexa-1,3-diene-1,3-dicarbonitrile::MLS000037765::SMR000039375::cid_658475
SMILES N=C1C(C#N)C(CC(C2CC2)=C1C#N)c1ccccc1
InChI Key InChIKey=YOINPERVOQYVSS-UHFFFAOYSA-N
Data  1 IC50
  Tab Delimited (TSV)   2D SDfile   Computed 3D by Vconf -m prep SDfile
Find this compound or compounds like it in BindingDB:
Activity Spreadsheet -- Enzyme Inhibition Constant Data from BindingDB
Found 1 hit for monomerid = 96112
TargetFructose-bisphosphate aldolase(Mycobacterium tuberculosis (strain H37Rv))
The Scripps Research Institute Molecular Screening Center
Curated by PubChem BioAssay
LigandPNGBDBM96112(2-amino-4-cyclopropyl-6-phenyl-cyclohexa-1,3-diene...)
Affinity DataIC50: >1.00E+4nM
Ligand InfoPC cidPC sid
In DepthDetails PCBioAssay