BDBM96116 MLS003120185::N-(3,4-dimethoxyphenyl)-4-[4-(dimethylamino)phenyl]-2-methyl-3H-furo[2,3-b]pyridine-2-carboxamide::SMR001289441::cid_49790960
SMILES COc1ccc(NC(=O)C2(C)Cc3c(O2)nccc3-c2ccc(cc2)N(C)C)cc1OC
InChI Key InChIKey=JXTYODTVJPDGEU-UHFFFAOYSA-N
Data  1 IC50
  Tab Delimited (TSV)   2D SDfile   Computed 3D by Vconf -m prep SDfile
Find this compound or compounds like it in BindingDB:
Activity Spreadsheet -- Enzyme Inhibition Constant Data from BindingDB
Found 1 hit for monomerid = 96116
TargetFructose-bisphosphate aldolase(Mycobacterium tuberculosis (strain H37Rv))
The Scripps Research Institute Molecular Screening Center
Curated by PubChem BioAssay
LigandPNGBDBM96116(MLS003120185 | N-(3,4-dimethoxyphenyl)-4-[4-(dimet...)
Affinity DataIC50:  731nM
In DepthDetails PCBioAssay