BDBM96117 (4-Methoxy-benzyl)-(4-methoxy-naphthalen-1-ylmethyl)-amine::(4-methoxy-1-naphthyl)methyl-p-anisyl-amine;oxalic acid::MLS001197103::N-[(4-methoxy-1-naphthalenyl)methyl]-1-(4-methoxyphenyl)methanamine;oxalic acid::N-[(4-methoxynaphthalen-1-yl)methyl]-1-(4-methoxyphenyl)methanamine;oxalic acid::SMR000555600::cid_17367486::ethanedioic acid;N-[(4-methoxynaphthalen-1-yl)methyl]-1-(4-methoxyphenyl)methanamine
SMILES COc1ccc(CNCc2ccc(OC)c3ccccc23)cc1
InChI Key InChIKey=DLJJKIZNSKJNOR-UHFFFAOYSA-N
Data  1 IC50
  Tab Delimited (TSV)   2D SDfile   Computed 3D by Vconf -m prep SDfile
Find this compound or compounds like it in BindingDB:
Activity Spreadsheet -- Enzyme Inhibition Constant Data from BindingDB
Found 1 hit for monomerid = 96117
TargetFructose-bisphosphate aldolase(Mycobacterium tuberculosis (strain H37Rv))
The Scripps Research Institute Molecular Screening Center
Curated by PubChem BioAssay
LigandPNGBDBM96117((4-Methoxy-benzyl)-(4-methoxy-naphthalen-1-ylmethy...)
Affinity DataIC50: >1.00E+4nM
In DepthDetails PCBioAssay