BDBM96125 5-(2-benzimidazolylidene)-4-methyl-2H-thiadiazole::5-(benzimidazol-2-ylidene)-4-methyl-2H-1,2,3-thiadiazole::5-(benzimidazol-2-ylidene)-4-methyl-2H-thiadiazole::MLS000096538::SMR000062459::cid_6400215
SMILES Cc1nnsc1-c1nc2ccccc2[nH]1
InChI Key InChIKey=FWZDEPFNQLNFON-UHFFFAOYSA-N
Data  1 IC50
  Tab Delimited (TSV)   2D SDfile   Computed 3D by Vconf -m prep SDfile
Find this compound or compounds like it in BindingDB:
Activity Spreadsheet -- Enzyme Inhibition Constant Data from BindingDB
Found 1 hit for monomerid = 96125
TargetFructose-bisphosphate aldolase(Mycobacterium tuberculosis (strain H37Rv))
The Scripps Research Institute Molecular Screening Center
Curated by PubChem BioAssay
LigandPNGBDBM96125(5-(2-benzimidazolylidene)-4-methyl-2H-thiadiazole ...)
Affinity DataIC50:  1.40E+3nM
In DepthDetails PCBioAssay