BDBM96131 2-methyl-N-(2-methyl-5-oxazolo[4,5-b]pyridin-2-yl-phenyl)propionamide::2-methyl-N-[2-methyl-5-(2-oxazolo[4,5-b]pyridinyl)phenyl]propanamide::2-methyl-N-[2-methyl-5-([1,3]oxazolo[4,5-b]pyridin-2-yl)phenyl]propanamide::MLS001206557::N-(2-Methyl-5-oxazolo[4,5-b]pyridin-2-yl-phenyl)-isobutyramide::SMR000517792::cid_694849
SMILES CC(C)C(=O)Nc1cc(ccc1C)-c1nc2ncccc2o1
InChI Key InChIKey=OODGQTKDNJTQEK-UHFFFAOYSA-N
Data  1 IC50
  Tab Delimited (TSV)   2D SDfile   Computed 3D by Vconf -m prep SDfile
Find this compound or compounds like it in BindingDB:
Activity Spreadsheet -- Enzyme Inhibition Constant Data from BindingDB
Found 1 hit for monomerid = 96131
TargetFructose-bisphosphate aldolase(Mycobacterium tuberculosis (strain H37Rv))
The Scripps Research Institute Molecular Screening Center
Curated by PubChem BioAssay
LigandPNGBDBM96131(2-methyl-N-(2-methyl-5-oxazolo[4,5-b]pyridin-2-yl-...)
Affinity DataIC50:  1.50E+3nM
In DepthDetails PCBioAssay