BDBM96151 9-(4-chlorophenyl)-3,3,6,6-tetramethyl-10-(2-morpholin-4-ylethyl)-3,4,6,7,9,10-hexahydroacridine-1,8(2H,5H)-dione::9-(4-chlorophenyl)-3,3,6,6-tetramethyl-10-(2-morpholin-4-ylethyl)-4,5,7,9-tetrahydro-2H-acridine-1,8-dione::9-(4-chlorophenyl)-3,3,6,6-tetramethyl-10-(2-morpholinoethyl)-4,5,7,9-tetrahydro-2H-acridine-1,8-quinone::9-(4-chlorophenyl)-3,3,6,6-tetramethyl-10-[2-(4-morpholinyl)ethyl]-4,5,7,9-tetrahydro-2H-acridine-1,8-dione::MLS000044145::SMR000021555::cid_3240720
SMILES CC1(C)CC(=O)C2=C(C1)N(CCN1CCOCC1)C1=C(C2c2ccc(Cl)cc2)C(=O)CC(C)(C)C1
InChI Key InChIKey=QYOSUELKMUHQCM-UHFFFAOYSA-N
Data  1 IC50
  Tab Delimited (TSV)   2D SDfile   Computed 3D by Vconf -m prep SDfile
Find this compound or compounds like it in BindingDB:
Activity Spreadsheet -- Enzyme Inhibition Constant Data from BindingDB
Found 1 hit for monomerid = 96151
TargetFructose-bisphosphate aldolase(Mycobacterium tuberculosis (strain H37Rv))
The Scripps Research Institute Molecular Screening Center
Curated by PubChem BioAssay
LigandPNGBDBM96151(9-(4-chlorophenyl)-3,3,6,6-tetramethyl-10-(2-morph...)
Affinity DataIC50:  2.33E+3nM
In DepthDetails PCBioAssay